هومئوپاتی
alternative label: درمان به‌ مثل
scope note: این روش در دانش پزشكی توسط پزشك آلمانی به نام هاهنمن (1843- 1755) Hahnemann پی‌ریزی شد. اساس و پایه روش درمانی او این بود: بیماریها را باید با داروهایی درمان كرد كه در افراد طبیعی، نشانه‌های همان بیماری را ایجاد می‌كنند.
broader: پزشکی تکمیلی
preferred label: Homeopathy @en
type: Concept

پزشکی تکمیلی
preferred label: Complementary medicine @en
type: Concept
narrower: هومئوپاتی