پزشکی
preferred label: Medicine @en
type: Concept
narrower: پزشکی سنتی

پزشکی سنتی
scope note: روشهای سنتی پزشكی در جوامع مختلف قبل از پزشكی مدرن. مانند پزشكی گیاهی، پزشكی سوزنی، پزشكی چینی سنتی، هومئوپاتی.
broader: پزشکی
preferred label: Orthodox medicine @en
type: Concept