کنترل عفونت
preferred label: Infection control @en
type: Concept
related: ایمن‌سازی

پزشکی پیشگیری
preferred label: Preventive medicine @en
type: Concept
narrower: ایمن‌سازی

ایمن‌سازی
alternative label: واكسيناسيون
scope note: مایه‌كوبی یا واكسن‌زنی برای حفاظت افراد حساس در برابر بیماری قابل واگیری از طریق تجویز سوسپانسیون ارگانیسمهای كشته (‌مانند سیاه‌سرفه) یا عامل بیماریزای زنده و تعدیل شده (مانند تب زرد) یا زهر غیر فعال شده (مانند كزاز).
related: کنترل عفونت
broader: پزشکی پیشگیری
preferred label: Immunization @en
type: Concept