ابراز وجود
preferred label: Assertiveness @en
type: Concept
related: عزت نفس

عزت نفس
alternative label: احترام به خود
scope note: احساس قائل‌ بودن ارزشی برای خود و طلب شناخته شدن آن ارزش.
related: ابراز وجود
related: عافیت
preferred label: Self esteem @en
type: Concept

عافیت
preferred label: Wellness @en
type: Concept
related: عزت نفس