دارو
preferred label: Medicine (Drug) @en
type: Concept
narrower: بنزودیازپین

بنزودیازپین
scope note: تركیب دارویی كه به‌عنوان آرامبخش و خواب‌آور خفیف به‌كار می‌رود.
broader: دارو
preferred label: Benzodiazepine @en
type: Concept