درد
preferred label: Pain @en
type: Concept
related: مسکن (دارو)

دارو
preferred label: Medicine (Drug) @en
type: Concept
narrower: مسکن (دارو)

مسکن (دارو)
scope note: داروهای مسكن كه برای كاهش درد به‌كار می‌روند، شامل دو گروه عمده هستند: 1- داروهای ضددرد غیر مخدر، مانند استامینوفن، آسپیرین و ایبوپروفن. 2- داروهای ضددرد مخدر، مثل كدئین، مورفین و متادون.
related: درد
broader: دارو
preferred label: Painkiller @en
type: Concept