ادراک
preferred label: Perception @en
type: Concept
related: کارکرد حسی

دستگاه اعصاب مرکزی
preferred label: Central nervous system @en
type: Concept
related: کارکرد حسی

کارکرد حسی
scope note: كاركرد مربوط به حواس، اعضای حسی، گیرنده‌های حسی، راههای عصبی آوران، داده های حسی، احساس و مانند اینها.
related: ادراک
related: دستگاه اعصاب مرکزی
preferred label: Sensory function @en
type: Concept