کارگر جنسی
alternative label: قواد
scope note: كسی كه از راه تدارك یا ارائه خدمات غیر اخلاقی جنسی امرار معاش می‌كند. مثل كارهای روسپیگری، مدل شدن جنسی، شركت در كارهای هرزه‌نگاری و نمایشهای جامه‌ریزان.
related: روسپیگری
preferred label: Sex worker @en
type: Concept

روسپیگری
preferred label: Prostitution @en
type: Concept
related: کارگر جنسی