مددکار اجتماعی
preferred label: Social worker @en
type: Concept
narrower: آسانساز

نمایش
preferred label: Drama @en
type: Concept
related: آسانساز

آسانساز
alternative label: آسانگر
scope note: اصطلاح تسهیل‌‌کننده برای درمانگری كه انواع خاصی از گروه درمانی را هدایت می‌كند، به‌كار می‌رود. در اینجا نقش درمانگر، آسان‌كردن جستجوی بینش‌های شخص توسط اعضای گروه است.
related: نمایش
broader: مددکار اجتماعی
preferred label: Facilitator @en
type: Concept