رفتار
preferred label: Behaviour @en
type: Concept
narrower: رفتار نوع ب

رفتار نوع ب
scope note: الگوی رفتاری كه نقطه مقابل رفتار نوع آ است. افراد دارای نوع (تیپ یا سنخ) شخصیتی ب، آرام، متعادل و ثابت قدم هستند و با آسانگیری در زندگی، تمركز بر كیفیت بیش از كمیت، رقابت پائین و سازگاری با محیط مشخص می‌شوند.
broader: رفتار
preferred label: Type B behaviour @en
type: Concept