مردم‌شناسی
preferred label: Anthropology @en
type: Concept
narrower: مردم‌شناسی پزشکی

پزشکی
preferred label: Medicine @en
type: Concept
related: مردم‌شناسی پزشکی

مردم‌شناسی پزشکی
scope note: این رشته از مردم‌شناسی به كار پزشكی و جنبه‌های فرهنگی تامین و دریافت خدمات بهداشتی مربوط است. مثلا موفقیت مبارزات ضد استعمال دخانیات بستگی به تغییر نظر مردم در مورد مصرف دخانیات دارد.
related: پزشکی
broader: مردم‌شناسی
preferred label: Medical anthropology @en
type: Concept