تمایلات جنسی
preferred label: Sexuality @en
type: Concept
narrower: دوگانگی جنسی

دوجنس‌گرا
preferred label: Bisexual person @en
type: Concept
related: دوگانگی جنسی

دوگانگی جنسی
alternative label: دوجنسيتي
scope note: صفات هر دو جنس را دارا بودن یا به هر دو جنس به‌طور یكسان علاقه‌مند و متمایل بودن.
related: دوجنس‌گرا
broader: تمایلات جنسی
preferred label: Bisexuality @en
type: Concept