دوستی
scope note: روابط بین‌ فردی مبتنی بر اشتراك مناقع و علاقه متقابل.
related: عاطفه
related: رابطه شخصی
preferred label: Friendship @en
type: Concept

رابطه شخصی
preferred label: Personal relationship @en
type: Concept
related: دوستی

عاطفه
preferred label: Affection @en
type: Concept
related: دوستی