قطع اندام تناسلی
alternative label: ختنه زنان
scope note: این اصطلاح بیشتر برای ختنه غیرقانونی زنان به‌كار رفته است كه نوعی قطع عضو به‌شمار می‌رود.ختنه دختران و زنان هنوز در بعضی از كشورهای آفریقایی مثل گینه، ساحل عاج، بوركینافاسو، نیجریه و غنا انجام می‌شود.
related: ختنه
preferred label: Genital mutilation @en
type: Concept

ختنه
preferred label: Circumcision @en
type: Concept
related: قطع اندام تناسلی