آبستنی
preferred label: Pregnancy @en
type: Concept
related: آبستنی نیابتی

آبستنی نیابتی
alternative label: آبستني ميانجي
scope note: اقدام یك زن برای بچه‌دارشدن برای زنی دیگر كه توانایی آبستن شدن را ندارد.
related: آبستنی
preferred label: Surrogacy @en
type: Concept