شیوه ارتباط
preferred label: Communication technique @en
type: Concept
related: همایش

همایش
alternative label: مجمع
scope note: گردهمایی عده‌ای یا افرادی از یك حوزه خاص ویا مجمع نمایندگان سیاسی یا روسای دولتها یا افراد احزاب و انجمنهای كشورهای مختلف - اعم از سیاسی، اجتماعی، ورزشی، هنری، علمی و جز اینها- كه برای بحث یا سخنرانی در مورد یك یا چند مسئله یا موضوع معین تشكیل می‌شود.
related: اشاعه اطلاعات
related: شیوه ارتباط
preferred label: Conference @en
type: Concept

اشاعه اطلاعات
preferred label: Information dissemination @en
type: Concept
related: همایش