خواب‌درمانی
alternative label: هيپنوتيسم‌درماني
scope note: اصطلاح كلی برای هر نوع رواندرمانی كه در آن از هیپنوتیسم یا خواب مصنوعی استفاده می‌شود.
broader: درمان
preferred label: Hypnotherapy @en
type: Concept

درمان
preferred label: Therapy @en
type: Concept
narrower: خواب‌درمانی