سرطان
preferred label: Cancer @en
type: Concept
related: پرتودرمانی

پرتودرمانی
scope note: كاربرد پرتو (پرتوهای مجهول، رادیم یا سایر مواد رادیواكتیو) در درمان بیماریها.
related: سرطان
broader: درمان
preferred label: Radiotherapy @en
type: Concept

درمان
preferred label: Therapy @en
type: Concept
narrower: پرتودرمانی