جنبه چند‌فرهنگی
preferred label: Multicultural aspect @en
type: Concept
related: دیگرپذیری

نگرش
preferred label: Attitude @en
type: Concept
related: دیگرپذیری

دیگرپذیری
alternative label: مدارا
scope note: خصوصیت اخلاقی كه بیانگر طرز برخورد با تمایلات، باورها، عادات، عقاید و رفتار با دیگران است. این خصوصیت، مستلزم پذیرش گرایشهای فكری مختلف، وجود بینش آزادیخواهانه و طرد هر گونه خودكامگی است. بر‌اساس موازین حقوق بشر، دیگرپذیری به معنی پذیرفتن بی‌عدالتی اجتماعی و یا دست كشیدن از باورهای خود و یا دادن امتیاز در این عرصه نیست.كاربرد دیگرپذیری بدین معنی است كه هر كس در گزینش باورهای خود آزاد است و می‌پذیرد كه دیگران نیز از همین آزادی بهره مند شوند.
related: نگرش
related: جنبه چند‌فرهنگی
preferred label: Tolerance @en
type: Concept