روش پژوهش
preferred label: Research method @en
type: Concept
related: گروه شاهد

گروه شاهد
alternative label: گروه مقايسه‌اي
scope note: آزمودنی‌هایی كه در یك مورد مطالعه مورد- شاهد، برای مقایسه به‌كار می‌روند. مثلا شاهدهای بیمارستانی، افردی از بیماران یك بیمارستان هستند كه برای مقایسه به‌كار گرفته می‌شوند.
related: روش پژوهش
preferred label: Control group @en
type: Concept