فرصت برابر
preferred label: Equal opportunity @en
type: Concept
related: نابرابری بهداشتی

همه‌گیری‌شناسی
preferred label: Epidemiology @en
type: Concept
related: نابرابری بهداشتی

نابرابری بهداشتی
alternative label: نابرابريهاي در بهداشت
scope note: گوناگونی در شاخصها یا نشانگرهای بهداشتی مرتبط با وضعیت اقتصادی و اجتماعی.
related: همه‌گیری‌شناسی
related: فرصت برابر
preferred label: Inequality in health @en
type: Concept