ارزش
scope note: از جنبه اجتماعی- فرهنگی، باورهای انسان است و آنچه در راه زندگی برای انسان دارای بهای گرانی است. ارزشها بر رفتار انسان به عنوان یك فرد، گروه، جامعه، فرهنگ و یا به عنوان نوع بشر اثر می‌گذارند و از این رو، عامل مهمی در سلامت مردم شمرده می‌شود.
related: انگیزش
preferred label: Value @en
type: Concept

انگیزش
preferred label: Motivation @en
type: Concept
related: ارزش