روش ‌دادن خبرهای‌ بد
preferred label: Technique for breaking bad news @en
type: Concept
broader: روش بحث

بحث گروهی
preferred label: Group discussion @en
type: Concept
related: روش بحث

روش بحث
alternative label: روش بحث و گفتگو
scope note: گفتگوی دو یا چند نفر درباره موضوعی، و اینكه هر كس بكوشد تا با آوردن دلایل و شواهد نظر خود را ثابت كند. بحث مانند یك ورزش فكری- بیانی است و باید قواعد مشخص داشته باشد تا آشكار شود كه نتیجه آن چیست.
narrower: روش ‌دادن خبرهای‌ بد
related: بحث گروهی
preferred label: Discussion technique @en
type: Concept