منشور (پزشکی)
alternative label: پروتكل (پزشكي)
scope note: برنامه یا مجموعه‌ای از چند مرحله كار كه باید در یك پژوهش یا مطالعه یا برنامه مداخله‌ای خاص مورد پیگیری قرار گیرد.
related: رویّه
preferred label: Protocol @en
type: Concept

رویّه
preferred label: Procedure @en
type: Concept
related: منشور (پزشکی)