بیماری دوران کودکی
preferred label: Childhood disease @en
type: Concept
narrower: آبله‌مرغان

آبله‌مرغان
alternative label: واريسلا
scope note: بیماری ویروسی واگیر دوران كودكی كه در نخستین روز بیماری، دانه‌هایی روی سینه پدیدار می‌شود. دوره نهفته آن دو تا شانزده روز است. سیر بیماری دو هفته طول می‌كشد. جدا‌سازی بیمار به مدت بیست روز ضروری است.
broader: بیماری دوران کودکی
preferred label: Chickenpox @en
type: Concept