سل
scope note: بیماری عفونی به علت باسیل مایكوباكتریوم توبركولوزیس. در سل ریوی، باسیل از راه تنفس وارد ریه‌ها می‌شود ودر آنجا یك توبركول اولیه پدید می‌آورد و به نزدیكترین گره‌های لنفی گسترش می‌یابد. نشانه‌های بیماری فعال عبارتند از: تب، عرق شبانه، كاهش وزن و خلط خون آلود. بسیاری از افراد نیز بدون اینكه نشانه‌ای داشته باشند مبتلا می‌شوند. اینها می‌توانند در نقش حامل عمل كنند و باسیل را با سرفه و عطسه انتقال دهند.
related: اختلال تنفسی
broader: بیماری واگیر
preferred label: Tuberculosis @en
type: Concept

بیماری واگیر
preferred label: Communicable disease @en
type: Concept
narrower: سل

اختلال تنفسی
preferred label: Respiratory disorder @en
type: Concept
related: سل