بیماری کرون
scope note: التهاب یا آماس بافت درونی جایی از چمروده (آخرین قسمت روده باریك كه دارای قوسهای متعدد است).
broader: اختلال لوله گوارش
preferred label: Crohn’s disease @en
type: Concept

اختلال لوله گوارش
preferred label: Digestive tract disorder @en
type: Concept
narrower: بیماری کرون