بیماری شکمی
alternative label: بيماري سلياك
scope note: در كودكی بروز می‌كند و علت آن سوء جذب چربی است. از علائم آن: لاغری، كندی تكامل، بزرگ شدن شكم، مدفوع زیاد و بد بو و چرب است.
broader: حساسیت غذایی
preferred label: Coeliac disease @en
type: Concept

حساسیت غذایی
preferred label: Food allergy @en
type: Concept
narrower: بیماری شکمی