اختلال روانی
preferred label: Mental disorder @en
type: Concept
narrower: زوال عقل

زوال عقل
alternative label: عقل‌فرسودگي
scope note: اختلال مزمن فرایندهای روانی كه با روانپریشی، موقعیت ناشناسی، اختلال در حافظه و بی‌‌شعوری همراه است.
narrower: بیماری آلزایمر
broader: اختلال روانی
preferred label: Dementia @en
type: Concept

بیماری آلزایمر
preferred label: Alzheimer’s disease @en
type: Concept
broader: زوال عقل