اختلال روانی
preferred label: Mental disorder @en
type: Concept
narrower: افسردگی

افسردگی پس از زایمان
preferred label: Postnatal depression @en
type: Concept
broader: افسردگی

افسردگی
scope note: تغییر خلق در جهت غمگینی یا حالتی هیجانی و ناخوشایند كه به دنبال شكست و ناكامی و یا بر اثر از دست‌دادن كسی یا چیزی به‌وجود می‌آید. ناامیدی، خستگی، بی‌حوصلگی، بی‌اشتهایی، بیخوابی، گاهی پرخوری یا پرخوابی، میل نداشتن به كار و ناتوانی در آغاز كردن فعالیت از جمله علائم افسردگی هستند. بر عكس این گونه افسردگیهای واكنشی، افسردگیهای درونزاد كه علت روشنی ندارند، لحظه‌ای بیمار را آسوده نمی‌گذارند و با حالت غم و اندوه عمیق، اضطراب، وحشت و توهم، وسواس و احساس گناه و بی‌ارزش دانستن خویش همراه است.
narrower: افسردگی پس از زایمان
broader: اختلال روانی
preferred label: Depression @en
type: Concept