بیماری پارکینسون
scope note: بیماری مغزی دوران كهولت كه همراه با سفتی و سختی حركات و تغییر رخسار و لرزش سر و دستها است.
broader: بیماری مغزی
preferred label: Parkinson’s disease @en
type: Concept

بیماری مغزی
preferred label: Brain disease @en
type: Concept
narrower: بیماری پارکینسون