بیماری گزارش‌دادنی
alternative label: بيماري واجب‌الاعلام
scope note: بیماریهایی كه باید به مقامات امور بهداشتی اعلام شود تا تدابیر و اقدامات پیشگیری‌كننده بموقع صورت گیرد و بیماریها مهار شوند، مانند وبا، دیفتری، طاعون، مالاریا، فلج كودكان، اسهال خونی، سرخك، آبله، حصبه.
related: بیماری واگیر
broader: بیماری
preferred label: Notifiable disease @en
type: Concept

بیماری واگیر
preferred label: Communicable disease @en
type: Concept
related: بیماری گزارش‌دادنی

بیماری
preferred label: Disease @en
type: Concept
narrower: بیماری گزارش‌دادنی