حساسیت
preferred label: Allergy @en
type: Concept
related: آسم

آسم
alternative label: نفس تنگي
scope note: حالتی كه با حملات گاه‌به‌گاه اسپاسم نایژه‌ها كه باعث دشواری در تنفس می‌گردد، مشخص می‌شود. آسم نایژه‌ای ممكن است به علت قرار گرفتن در معرض حساسیت‌زاها، فعالیت جسمانی، عواطف و عفونتها پیش آید.
related: حساسیت
broader: اختلال تنفسی
preferred label: Asthma @en
type: Concept

اختلال تنفسی
preferred label: Respiratory disorder @en
type: Concept
narrower: آسم