التهاب نایژه
alternative label: برونشيت
scope note: التهاب نایژه‌ها یا راههای هوای شش. این بیماری بویژه در ارتباط با استعمال دخانیات، آلودگی هوا و آمفیزم شایع است.
broader: اختلال تنفسی
preferred label: Bronchitis @en
type: Concept

اختلال تنفسی
preferred label: Respiratory disorder @en
type: Concept
narrower: التهاب نایژه