آمفیزم
alternative label: نفخ ريه
scope note: پیدایش هوا یا گاز به‌طور غیر عادی در بافتهای بدن، بویژه در ششها.
broader: اختلال تنفسی
preferred label: Emphysema @en
type: Concept

اختلال تنفسی
preferred label: Respiratory disorder @en
type: Concept
narrower: آمفیزم