بیماری پوست
preferred label: Skin disease @en
type: Concept
narrower: آکنه

آکنه
alternative label: جوش غرور جواني
scope note: بیماری مزمن پوست كه غدد چربی صورت، شانه‌ها یا پشت و سینه را گرفتار می‌كند.
broader: بیماری پوست
preferred label: Acne @en
type: Concept