آزار جنسی کودک
preferred label: Child sexual abuse @en
type: Concept
broader: آزار کودک

آزار
preferred label: Abuse @en
type: Concept
narrower: آزار کودک

آزار کودک
alternative label: كودك آزاري
scope note: بدرفتاری با كودك یا رساندن آزار جسمی، جنسی، روانی و مانند اینها به كودك. فقر اقتصادی والدین، ناآگاهی والدین، مشكلات خانوادگی، بیكاری، مهاجرت به شهرهای بزرگ، حاشیه نشینی، پرخاشگری و اعتیاد والدین از جمله عوامل آزار كودكان در ایران است.
narrower: آزار جنسی کودک
broader: آزار
preferred label: Child abuse @en
type: Concept