آزار
preferred label: Abuse @en
type: Concept
narrower: آزار بزرگسال

سالخورده
preferred label: Older person @en
type: Concept
related: آزار بزرگسال

آزار بزرگسال
alternative label: سالمند آزاري
scope note: بدرفتاری یا سوء‌استفاده جسمی یا روانی از بزرگسالان ، توسط فرزندان یا اشخاصی كه مراقبت از آنها را بر عهده دارند.
related: سالخورده
broader: آزار
preferred label: Elder abuse @en
type: Concept