گروه
preferred label: Group @en
type: Concept
related: گروه درمانی

گروه درمانی
scope note: نوعی درمان كه افراد دچار ناراحتی هیجانی به دقت انتخاب شده را برای كمك به یكدیگر در تغییر دادن شخصیت خود، در گروهی كه به وسیله یك درمانگر ماهر هدایت می‌شود، قرار می‌دهند.
related: گروه
broader: روان‌درمانی
preferred label: Group therapy @en
type: Concept

روان‌درمانی
preferred label: Psychotherapy @en
type: Concept
narrower: گروه درمانی