اکستاسی
alternative label: متيلن دي ‌‌اكسي‌ متا مفتامين
scope note: واژه اكستاسی به معنی خلسه (وجد) است.قرص اكستاسی (3، 4- متیلن دی‌اكسی متامفتامین) اولین بار در سال 1913 در آلمان برای كاهش اشتها به منظور درمان چاقی بكار رفت. در سال 1970 این ماده برای مقابله با افسردگی تجویز شد. در اوایل دهه 1980 استفاده از آن به دلیل عوارض جانبی شدید ممنوع اعلام گردید. اثرات آن شامل افزایش خوشی شدید، افزایش انرژی، احساس تمایل به دیگران، افزایش هوشیاری و درك موسیقی ، افزایش حس بویایی و چشایی است. با یكبار مصرف آسیبهای شدید مغزی ایجاد می‌كند.
broader: ماده مخدر
preferred label: Ecstasy @en
type: Concept

ماده مخدر
preferred label: Drug @en
type: Concept
narrower: اکستاسی