رشد بدنی
preferred label: Physical development @en
type: Concept
related: کم‌وزنی

وزن
preferred label: Weight @en
type: Concept
narrower: کم‌وزنی

کم‌وزنی
scope note: پایین بودن وزن بدن به اندازه ده درصد كمتر از میزان بهنجار برای نوع بدنی و سن فرد. رقم ده درصد، یك معیار اختیاری و قابل انعطاف است.
related: رشد بدنی
broader: وزن
preferred label: Underweight @en
type: Concept