احیا
alternative label: به‌هوش آوري
scope note: دوباره جان‌دادن یا زنده كردن و یا جریان عادی تنفس را به شخص برگرداندن.
related: کمکهای اولیه
preferred label: Resuscitation @en
type: Concept

کمکهای اولیه
preferred label: First aid @en
type: Concept
related: احیا