سلامت
preferred label: Health @en
type: Concept
related: خطر بهداشتی

احتمال خطر
preferred label: Risk @en
type: Concept
narrower: خطر بهداشتی

خطر بهداشتی
scope note: خطرهایی كه در برابر سلامت انسان قرار دارند. خطرهایی مانند استعمال دخانیات و مواد مخدر، بی‌بند و باری جنسی، خوردن قند و چربی، تحت فشار روانی و تحقیر قرار ‌گرفتن.
related: سلامت
broader: احتمال خطر
preferred label: Health hazard @en
type: Concept