جبر هیلبرت چپ
type: Concept
broader: جبر هیلبرت
preferred label: left Hilbert algebra @en
scope note: جبری همراه یک برگشت با ضابطه x به x# و یک ضرب داخلی با ویژگی های خاصی است.

جبر هیلبرت
type: Concept
narrower: جبر هیلبرت چپ
preferred label: Hilbert algebra @en