فضای چلیکی
type: Concept
broader: فضای برداری توپولوژیک
preferred label: barrelled space @en
related: همسایگی
scope note: فضاهای برداری توپولوژیک که هر مجموعه چلیک در این فضا یک همسایگی برای بردار صفر است.

فضای برداری توپولوژیک
type: Concept
narrower: فضای چلیکی
preferred label: topological vector space @en

همسایگی
type: Concept
preferred label: neighborhood @en
related: فضای چلیکی