قضیه باناخ-آلااغلو
type: Concept
preferred label: Banach-Alaoglu theorem @en
related: قطبی یک مجموعه

قطبی یک مجموعه
type: Concept
broader: فضای برداری توپولوژیک
preferred label: polar of a set @en
related: قضیه باناخ-آلااغلو
scope note: قطبی مجموعه V، مجموعه تابعک هایی از فضای دوگان است به طوری که نرم تصویر اعضای V تحت این تابعک ها از یک نابیشتر باشد.

فضای برداری توپولوژیک
type: Concept
narrower: قطبی یک مجموعه
preferred label: topological vector space @en