دقت منبسط
type: Concept
broader: دقت ماشین
preferred label: extended precision @en
scope note: دقت وسعت یافته ممکن است هم ارز 19 تا 20 رقم با معنی باشد.

دقت ماشین
type: Concept
narrower: دقت منبسط
preferred label: machine precision @en