خطای لپی
type: Concept
broader: خطا
preferred label: blunder error @en
scope note: خطایی که به علت دخالت ما در برنامه نویسی، عمل، آماده سازی ورودی و تفسیر خروجی رخ می دهد.

خطا
type: Concept
narrower: خطای لپی
preferred label: error @en