برون‌یابی مخروطی
type: Concept
broader: برون‌یابی
preferred label: conic extrapolation @en
scope note: برونیابی مخروطی از پنج نقطه نزدیک یک مقدار مشخص برای برونیابی استفاده می کند.

برون‌یابی
type: Concept
narrower: برون‌یابی مخروطی
preferred label: extrapolation @en