اسپلاین درجه سه
type: Concept
alternative label: اسپلاین مکعبی
broader: تابع اسپلاین درجه سه
preferred label: cubic spline @en
related: تابع نیرو
scope note: هر عضو گردایه‌ای از چندجمله‌ای‌های درجۀ سه که برای درون‌یابی تابعی به کار می‌رود.

تابع اسپلاین درجه سه
type: Concept
narrower: اسپلاین درجه سه
preferred label: cubic spline function @en

تابع نیرو
type: Concept
preferred label: forcing function @en
related: اسپلاین درجه سه